{"text_format":"1","workbook":"xlsx","n_sheets":3,"sheets":["使用法","予測","気象データ"],"not_rendered":{"charts":0,"images":0,"macros":0,"external_links":0,"defined_names":4,"comments":1,"pivot_tables":0},"unopened":[],"bounds":{"document_bytes":16777216,"sheet_cells":100000,"rows_first":2000,"rows_last":500,"rows_between":2000,"halvings":0,"cell_chars":16384,"cell_head_chars":4096},"cells_cut":0,"cells_raw":0,"read":"whole","date_system":"1900"}

{"sheet":"使用法","index":0,"n_rows":283,"n_cols":13,"rows_kept":283,"cut":false,"hidden":false,"merged":[[4,1,4,2],[5,1,5,2],[5,5,5,6],[5,7,5,9],[8,5,8,6],[8,7,8,9],[7,1,7,2],[1,5,1,6],[1,7,1,9],[6,5,6,6],[6,7,6,9],[7,5,7,6],[7,7,7,9],[13,11,47,14],[9,5,9,6],[9,7,9,9],[9,11,9,12],[11,1,12,1],[11,2,12,2],[11,3,11,6],[11,7,12,7],[11,8,12,8],[11,9,12,9]]}
[]
[null,null,null,null,null,"予測実施日",null,"2019-03-21"]
[null,"播種期","から予測"]
[]
[null,"予測地域",null,null,null,"予測値"]
[null,"水戸",null,null,null,"播   種   期:",null,"2002-11-05"]
[null,null,null,null,null,"出   芽   期:",null,"2002-11-15"]
[null,"播種期",null,null,null,"茎   立   期:",null,"2003-03-28",null,null,null,"平年比"]
[null,"月","日",null,null,"出   穂   期:",null,"2003-04-25",null,null,null,0,"℃"]
[null,11,5,null,null,"成   熟   期:",null,"2003-06-12",null,null,null,"で推移した場合"]
[]
[null,"月･日","播種期後日数","判　定",null,null,null,"平年平均　気温(℃)\n(水戸地方気象台1981-2010)","本年平均　      気温　　(℃)","予測に用いるデータ"]
[null,null,null,"出芽期","茎立期","出穂期","成熟期"]
[null,"2002-10-15",0,"-","-","-","-",16.2,null,"",null,"使用方法：※入力が必要なのは黄色の部分です。\n①予測の起点としたい生育ステージ(播種期，出芽期，茎立期，出穂期)を選択してください。\n②予測地域を選択してください。予測したい圃場の最寄の気象観測地点を選びます。\n③起点としたい生育ステージ(播種期，茎立期，出穂期)に達した日付を選択してください。予測できるのは10/15以降です。\n④判明している範囲の本年の日平均気温を入力してください。本年データが多いほうが，予測精度が増します。未入力部分は平年値を用いて自動的に計算されます。予測起点以前のデータも自動的に除外されて計算されます。｢クリア｣ボタンを押すと入力した気温データが消去されます｡\n⑤青い欄に予測結果が表示されます。\n⑥気温が平年より高く(低く)推移した場合を予測するには，平年比の欄に数値を入力することで，数値を反映した平年値で計算されます。\n\n使用上の注意点:\n①圃場が気温測定地点から離れていたり，気象経過が平年と大きく異なる，あるいは倒伏・湿害等による生育への影響が大きい場合には，予測の精度が劣る可能性があります。\n②予測日以降の気温が平年と異なる場合は誤差が拡大していくので，後日再度予測することで精度が高まります｡\n③出穂期，成熟期等の対平年値遅速は予測モデルに頼りすぎず，現地の状況や研究所発行の生育状況などを勘案し，総合的に判断してください｡\n④うるう年には対応していません。うるう年で，予測結果が3月1日以降で表示された場合は，表示された日から1日引いた日が正しい予測日となります。"]
[null,"2002-10-16",0,"-","-","-","-",16,null,""]
[null,"2002-10-17",0,"-","-","-","-",15.8,null,""]
[null,"2002-10-18",0,"-","-","-","-",15.6,null,""]
[null,"2002-10-19",0,"-","-","-","-",15.3,null,""]
[null,"2002-10-20",0,"-","-","-","-",15.1,null,""]
[null,"2002-10-21",0,"-","-","-","-",14.9,null,""]
[null,"2002-10-22",0,"-","-","-","-",14.6,null,""]
[null,"2002-10-23",0,"-","-","-","-",14.4,null,""]
[null,"2002-10-24",0,"-","-","-","-",14.2,null,""]
[null,"2002-10-25",0,"-","-","-","-",14,null,""]
[null,"2002-10-26",0,"-","-","-","-",13.9,null,""]
[null,"2002-10-27",0,"-","-","-","-",13.7,null,""]
[null,"2002-10-28",0,"-","-","-","-",13.5,null,""]
[null,"2002-10-29",0,"-","-","-","-",13.4,null,""]
[null,"2002-10-30",0,"-","-","-","-",13.2,null,""]
[null,"2002-10-31",0,"-","-","-","-",13,null,""]
[null,"2002-11-01",0,"-","-","-","-",12.9,null,""]
[null,"2002-11-02",0,"-","-","-","-",12.7,null,""]
[null,"2002-11-03",0,"-","-","-","-",12.6,null,""]
[null,"2002-11-04",0,"-","-","-","-",12.4,null,""]
[null,"2002-11-05",0,"-","-","-","-",12.2,null,""]
[null,"2002-11-06",1,"-","-","-","-",12.1,null,12.1]
[null,"2002-11-07",2,"-","-","-","-",11.9,null,11.9]
[null,"2002-11-08",3,"-","-","-","-",11.7,null,11.7]
[null,"2002-11-09",4,"-","-","-","-",11.5,null,11.5]
[null,"2002-11-10",5,"-","-","-","-",11.3,null,11.3]
{"$rows_left_out":244}
{"sheet":"予測","index":1,"n_rows":283,"n_cols":37,"rows_kept":283,"cut":false,"hidden":false,"merged":[[8,28,8,29],[8,31,8,33],[1,28,1,29],[1,31,1,33],[4,1,4,2],[5,1,5,2],[5,28,5,29],[5,31,5,33],[6,28,6,29],[6,31,6,33],[7,1,7,2],[7,28,7,29],[7,31,7,33],[11,33,12,33],[9,28,9,29],[9,31,9,33],[9,35,9,36],[11,1,12,1],[11,2,12,2],[11,4,12,4],[11,26,11,29],[11,30,12,30],[11,31,12,31],[11,32,12,32],[11,3,12,3]]}
[null,null,null,null,null,"予測始期","予測終期","G","A","Th","B","Lc"]
[null,null,null,null,null,"播種期","出芽期",6.2239579999999997,0.30877080000000001,9.5643460000000005,"－","－",null,null,null,null,null,null,null,null,null,null,null,null,null,null,null,null,"予測実施日",null,null,{"$f":"TODAY()","v":"2022-04-15"}]
[null,"播種期","から予測",null,null,"播種期","茎立期"]
[null,null,null,null,null,"播種期","出穂期"]
[null,"予測地域",null,"地名コード",null,"播種期","成熟期",null,null,null,null,null,null,null,null,null,null,null,null,null,null,null,null,null,null,null,null,null,"予測値"]
[null,"水戸",null,{"$f":"HLOOKUP(B6,気象データ!$B$4:$O$5,2,FALSE)","v":"G"},null,"出芽期","茎立期",39.372700000000002,0.52176180000000005,5.3057790000000002,1.0498430000000001,9.0194139999999994,null,null,null,null,null,null,null,null,null,null,null,null,null,null,null,null,"播   種   期:",null,{"$f":"VLOOKUP(\"◎\",Z14:AE283,6,FALSE)","v":"2002-11-05"},{"$f":"+IF(COUNT(AE6)=1,AE6,\"*月 *日\")","v":"2002-11-05"}]
[null,null,null,null,null,"出芽期","出穂期",61.026449999999997,0.30559350000000002,4.1868220000000003,1.426437,9.3751309999999997,null,null,null,null,null,null,null,null,null,null,null,null,null,null,null,null,"出   芽   期:",null,{"$f":"VLOOKUP(\"◎\",AA14:AE283,5,FALSE)","v":"2002-11-15"},{"$f":"+IF(COUNT(AE7)=1,AE7,\"*月 *日\")","v":"2002-11-15"}]
[null,{"$f":"B3","v":"播種期"},null,null,null,"出芽期","成熟期",null,null,null,null,null,null,null,null,null,null,null,null,null,null,null,null,null,null,null,null,null,"茎   立   期:",null,{"$f":"VLOOKUP(\"◎\",AB14:AE283,4,FALSE)","v":"2003-03-19"},{"$f":"+IF(COUNT(AE8)=1,AE8,\"*月 *日\")","v":"2003-03-19"},null,null,null,"平年比"]
[null,"月","日",null,null,"茎立期","出穂期",7.7224620000000002,0.33123580000000002,13.98748,"－","－",null,null,null,null,null,null,null,null,null,null,null,null,null,null,null,null,"出   穂   期:",null,{"$f":"VLOOKUP(\"◎\",AC14:AE283,3,FALSE)","v":"2003-04-12"},{"$f":"+IF(COUNT(AE9)=1,AE9,\"*月 *日\")","v":"2003-04-12"},null,null,null,0,"℃"]
[null,11,5,null,null,"茎立期","成熟期",null,null,null,"－","－",null,null,null,null,null,null,null,null,null,null,null,null,null,null,null,null,"成   熟   期:",null,{"$f":"VLOOKUP(\"◎\",AD14:AE283,2,FALSE)","v":"2003-05-27"},{"$f":"+IF(COUNT(AE10)=1,AE10,\"*月 *日\")","v":"2003-05-27"},null,null,null,"で推移した場合"]
[null,null,null,null,null,"出穂期","成熟期",32.910989999999998,0.17186960000000001,9.2607769999999991,"－","－"]
[null,"月･日",{"$f":"B3&\"後日数\"","v":"播種期後日数"},"予測日判定","日長(時間)","DVR",null,null,null,null,null,null,null,null,null,null,null,null,null,null,null,null,null,null,null,null,"判　定",null,null,null,"月･日","平年平均　気温(℃)\n(水戸地方気象台1981-2010)","本年平均　      気温　　(℃)","予測に用いるデータ"]
[null,null,null,null,null,"播種出芽","積算","播種茎立","積算","播種出穂","積算","播種成熟","積算","出芽茎立","積算","出芽出穂","積算","出芽成熟","積算","茎立出穂","積算","茎立成熟","積算","出穂成熟","積算","播種期","出芽期","茎立期","出穂期","成熟期"]
[null,"2002-10-15",{"$f":"+C13+D14","v":0},{"$f":"+IF((COUNT(AH14))=1,1)+IF((COUNT(AH14=0)),0)","v":0},{"$f":"INDIRECT(\"気象データ!\"&$D$6&ROW()+320)","v":11.1138750716303},{"$f":"1/(1+EXP(-$I$2*($AH14-$J$2)))/$H$2","v":{"$error":"#VALUE!"}},{"$f":"IF($D14=0,0,G13+F14)","v":0},{"$f":"IF(G13>=1,MAX((1-EXP(-$K$6*($E14-$L$6)))/(1+EXP(-$I$6*($AH14-$J$6)))/$H$6,0),0)","v":{"$error":"#VALUE!"}},{"$f":"IF($D14=0,0,I13+H14)","v":0},{"$f":"IF(G13>=1,MAX((1-EXP(-$K$7*($E14-$L$7)))/(1+EXP(-$I$7*($AH14-$J$7)))/$H$7,0),0)","v":{"$error":"#VALUE!"}},{"$f":"IF($D14=0,0,K13+J14)","v":0},{"$f":"IF(K13>=1,1/(1+EXP(-$I$11*($AH14-$J$11)))/$H$11,0)","v":{"$error":"#VALUE!"}},{"$f":"IF($D14=0,0,M13+L14)","v":0},{"$f":"MAX((1-EXP(-$K$6*($E14-$L$6)))/(1+EXP(-$I$6*($AH14-$J$6)))/$H$6,0)","v":{"$error":"#VALUE!"}},{"$f":"IF($D14=0,0,O13+N14)","v":0},{"$f":"MAX((1-EXP(-$K$7*($E14-$L$7)))/(1+EXP(-$I$7*($AH14-$J$7)))/$H$7,0)","v":{"$error":"#VALUE!"}},{"$f":"IF($D14=0,0,Q13+P14)","v":0},{"$f":"IF(Q13>=1,1/(1+EXP(-$I$11*($AH14-$J$11)))/$H$11,0)","v":{"$error":"#VALUE!"}},{"$f":"IF($D14=0,0,S13+R14)","v":0},{"$f":"1/(1+EXP(-$I$9*($AH14-$J$9)))/$H$9","v":{"$error":"#VALUE!"}},{"$f":"IF($D14=0,0,U13+T14)","v":0},{"$f":"IF(U13>=1,1/(1+EXP(-$I$11*($AH14-$J$11)))/$H$11,0)","v":{"$error":"#VALUE!"}},{"$f":"IF($D14=0,0,W13+V14)","v":0},{"$f":"1/(1+EXP(-$I$11*($AH14-$J$11)))/$H$11","v":{"$error":"#VALUE!"}},{"$f":"IF($D14=0,0,Y13+X14)","v":0},{"$f":"IF($B$3=\"播種期\",IF($C15=1,\"◎\",\"-\"),\"-\")","v":"-"},{"$f":"IF($B$3=\"播種期\",IF(AND(G14>=1,G13<1),\"◎\",\"-\"),IF($B$3=\"出芽期\",IF($C15=1,\"◎\",\"-\"),\"-\"))","v":"-"},{"$f":"IF($B$3=\"播種期\",IF(AND(I14>=1,I13<1),\"◎\",\"-\"),IF($B$3=\"出芽期\",IF(AND(O14>=1,O13<1),\"◎\",\"-\"),IF($B$3=\"茎立期\",IF($C15=1,\"◎\",\"-\"),\"-\")))","v":"-"},{"$f":"IF($B$3=\"播種期\",IF(AND(K14>=1,K13<1),\"◎\",\"-\"),IF($B$3=\"出芽期\",IF(AND(Q14>=1,Q13<1),\"◎\",\"-\"),IF($B$3=\"茎立期\",IF(AND(U14>=1,U13<1),\"◎\",\"-\"),IF($B$3=\"出穂期\",IF($C15=1,\"◎\",\"-\"),\"-\"))))","v":"-"},{"$f":"IF($B$3=\"播種期\",IF(AND(M14>=1,M13<1),\"◎\",\"-\"),IF($B$3=\"出芽期\",IF(AND(S14>=1,S13<1),\"◎\",\"-\"),IF($B$3=\"茎立期\",IF(AND(W14>=1,W13<1),\"◎\",\"-\"),IF($B$3=\"出穂期\",IF(AND(Y14>=1,Y13<1),\"◎\",\"-\"),IF($C15=1,\"◎\",\"-\")))))","v":"-"},"2002-10-15",{"$f":"INDIRECT(\"気象データ!\"&$D$6&ROW()-8)","v":16.7},null,{"$f":"IF(DATE(IF($B$10>=10,2002,2003),$B$10,$C$10)>=B14,\"\",IF(AG14=\"\",AF14+$AJ$9,AG14))","v":""}]
[null,"2002-10-16",0,0,{"$f":"INDIRECT(\"気象データ!\"&$D$6&ROW()+320)","v":11.076644219068699},{"$error":"#VALUE!"},{"$f":"IF($D15=0,0,G14+F15)","v":0},{"$f":"IF(G14>=1,MAX((1-EXP(-$K$6*($E15-$L$6)))/(1+EXP(-$I$6*($AH15-$J$6)))/$H$6,0),0)","v":0},{"$f":"IF($D15=0,0,I14+H15)","v":0},{"$f":"IF(G14>=1,MAX((1-EXP(-$K$7*($E15-$L$7)))/(1+EXP(-$I$7*($AH15-$J$7)))/$H$7,0),0)","v":0},{"$f":"IF($D15=0,0,K14+J15)","v":0},{"$f":"IF(K14>=1,1/(1+EXP(-$I$11*($AH15-$J$11)))/$H$11,0)","v":0},{"$f":"IF($D15=0,0,M14+L15)","v":0},{"$error":"#VALUE!"},{"$f":"IF($D15=0,0,O14+N15)","v":0},{"$f":"MAX((1-EXP(-$K$7*($E15-$L$7)))/(1+EXP(-$I$7*($AH15-$J$7)))/$H$7,0)","v":{"$error":"#VALUE!"}},{"$f":"IF($D15=0,0,Q14+P15)","v":0},{"$f":"IF(Q14>=1,1/(1+EXP(-$I$11*($AH15-$J$11)))/$H$11,0)","v":0},{"$f":"IF($D15=0,0,S14+R15)","v":0},{"$error":"#VALUE!"},{"$f":"IF($D15=0,0,U14+T15)","v":0},{"$f":"IF(U14>=1,1/(1+EXP(-$I$11*($AH15-$J$11)))/$H$11,0)","v":0},{"$f":"IF($D15=0,0,W14+V15)","v":0},{"$error":"#VALUE!"},{"$f":"IF($D15=0,0,Y14+X15)","v":0},{"$f":"IF($B$3=\"播種期\",IF($C16=1,\"◎\",\"-\"),\"-\")","v":"-"},{"$f":"IF($B$3=\"播種期\",IF(AND(G15>=1,G14<1),\"◎\",\"-\"),IF($B$3=\"出芽期\",IF($C16=1,\"◎\",\"-\"),\"-\"))","v":"-"},{"$f":"IF($B$3=\"播種期\",IF(AND(I15>=1,I14<1),\"◎\",\"-\"),IF($B$3=\"出芽期\",IF(AND(O15>=1,O14<1),\"◎\",\"-\"),IF($B$3=\"茎立期\",IF($C16=1,\"◎\",\"-\"),\"-\")))","v":"-"},{"$f":"IF($B$3=\"播種期\",IF(AND(K15>=1,K14<1),\"◎\",\"-\"),IF($B$3=\"出芽期\",IF(AND(Q15>=1,Q14<1),\"◎\",\"-\"),IF($B$3=\"茎立期\",IF(AND(U15>=1,U14<1),\"◎\",\"-\"),IF($B$3=\"出穂期\",IF($C16=1,\"◎\",\"-\"),\"-\"))))","v":"-"},{"$f":"IF($B$3=\"播種期\",IF(AND(M15>=1,M14<1),\"◎\",\"-\"),IF($B$3=\"出芽期\",IF(AND(S15>=1,S14<1),\"◎\",\"-\"),IF($B$3=\"茎立期\",IF(AND(W15>=1,W14<1),\"◎\",\"-\"),IF($B$3=\"出穂期\",IF(AND(Y15>=1,Y14<1),\"◎\",\"-\"),IF($C16=1,\"◎\",\"-\")))))","v":"-"},"2002-10-16",{"$f":"INDIRECT(\"気象データ!\"&$D$6&ROW()-8)","v":16.5},null,""]
[null,"2002-10-17",0,0,11.0395861891944,{"$error":"#VALUE!"},0,0,0,0,0,0,0,{"$error":"#VALUE!"},0,{"$error":"#VALUE!"},0,0,0,{"$error":"#VALUE!"},0,0,0,{"$error":"#VALUE!"},0,"-","-","-","-","-","2002-10-17",16.3,null,""]
[null,"2002-10-18",0,0,11.0027096411487,{"$error":"#VALUE!"},0,0,0,0,0,0,0,{"$error":"#VALUE!"},0,{"$error":"#VALUE!"},0,0,0,{"$error":"#VALUE!"},0,0,0,{"$error":"#VALUE!"},0,"-","-","-","-","-","2002-10-18",16.100000000000001,null,""]
[null,"2002-10-19",0,0,10.9660233975628,{"$error":"#VALUE!"},0,0,0,0,0,0,0,{"$error":"#VALUE!"},0,{"$error":"#VALUE!"},0,0,0,{"$error":"#VALUE!"},0,0,0,{"$error":"#VALUE!"},0,"-","-","-","-","-","2002-10-19",15.9,null,""]
[null,"2002-10-20",0,0,10.929536447931699,{"$error":"#VALUE!"},0,0,0,0,0,0,0,{"$error":"#VALUE!"},0,{"$error":"#VALUE!"},0,0,0,{"$error":"#VALUE!"},0,0,0,{"$error":"#VALUE!"},0,"-","-","-","-","-","2002-10-20",15.7,null,""]
[null,"2002-10-21",0,0,10.893257951577599,{"$error":"#VALUE!"},0,0,0,0,0,0,0,{"$error":"#VALUE!"},0,{"$error":"#VALUE!"},0,0,0,{"$error":"#VALUE!"},0,0,0,{"$error":"#VALUE!"},0,"-","-","-","-","-","2002-10-21",15.5,null,""]
[null,"2002-10-22",0,0,10.857197240182,{"$error":"#VALUE!"},0,0,0,0,0,0,0,{"$error":"#VALUE!"},0,{"$error":"#VALUE!"},0,0,0,{"$error":"#VALUE!"},0,0,0,{"$error":"#VALUE!"},0,"-","-","-","-","-","2002-10-22",15.3,null,""]
[null,"2002-10-23",0,0,10.8213638198625,{"$error":"#VALUE!"},0,0,0,0,0,0,0,{"$error":"#VALUE!"},0,{"$error":"#VALUE!"},0,0,0,{"$error":"#VALUE!"},0,0,0,{"$error":"#VALUE!"},0,"-","-","-","-","-","2002-10-23",15.1,null,""]
[null,"2002-10-24",0,0,10.7857673727746,{"$error":"#VALUE!"},0,0,0,0,0,0,0,{"$error":"#VALUE!"},0,{"$error":"#VALUE!"},0,0,0,{"$error":"#VALUE!"},0,0,0,{"$error":"#VALUE!"},0,"-","-","-","-","-","2002-10-24",15,null,""]
[null,"2002-10-25",0,0,10.7504177582144,{"$error":"#VALUE!"},0,0,0,0,0,0,0,{"$error":"#VALUE!"},0,{"$error":"#VALUE!"},0,0,0,{"$error":"#VALUE!"},0,0,0,{"$error":"#VALUE!"},0,"-","-","-","-","-","2002-10-25",14.8,null,""]
[null,"2002-10-26",0,0,10.7153250132013,{"$error":"#VALUE!"},0,0,0,0,0,0,0,{"$error":"#VALUE!"},0,{"$error":"#VALUE!"},0,0,0,{"$error":"#VALUE!"},0,0,0,{"$error":"#VALUE!"},0,"-","-","-","-","-","2002-10-26",14.6,null,""]
[null,"2002-10-27",0,0,10.6804993525177,{"$error":"#VALUE!"},0,0,0,0,0,0,0,{"$error":"#VALUE!"},0,{"$error":"#VALUE!"},0,0,0,{"$error":"#VALUE!"},0,0,0,{"$error":"#VALUE!"},0,"-","-","-","-","-","2002-10-27",14.4,null,""]
[null,"2002-10-28",0,0,10.6459511681841,{"$error":"#VALUE!"},0,0,0,0,0,0,0,{"$error":"#VALUE!"},0,{"$error":"#VALUE!"},0,0,0,{"$error":"#VALUE!"},0,0,0,{"$error":"#VALUE!"},0,"-","-","-","-","-","2002-10-28",14.2,null,""]
[null,"2002-10-29",0,0,10.611691028347501,{"$error":"#VALUE!"},0,0,0,0,0,0,0,{"$error":"#VALUE!"},0,{"$error":"#VALUE!"},0,0,0,{"$error":"#VALUE!"},0,0,0,{"$error":"#VALUE!"},0,"-","-","-","-","-","2002-10-29",14,null,""]
[null,"2002-10-30",0,0,10.5777296755621,{"$error":"#VALUE!"},0,0,0,0,0,0,0,{"$error":"#VALUE!"},0,{"$error":"#VALUE!"},0,0,0,{"$error":"#VALUE!"},0,0,0,{"$error":"#VALUE!"},0,"-","-","-","-","-","2002-10-30",13.9,null,""]
[null,"2002-10-31",0,0,10.5440780244415,{"$error":"#VALUE!"},0,0,0,0,0,0,0,{"$error":"#VALUE!"},0,{"$error":"#VALUE!"},0,0,0,{"$error":"#VALUE!"},0,0,0,{"$error":"#VALUE!"},0,"-","-","-","-","-","2002-10-31",13.7,null,""]
[null,"2002-11-01",0,0,10.510747158662401,{"$error":"#VALUE!"},0,0,0,0,0,0,0,{"$error":"#VALUE!"},0,{"$error":"#VALUE!"},0,0,0,{"$error":"#VALUE!"},0,0,0,{"$error":"#VALUE!"},0,"-","-","-","-","-","2002-11-01",13.5,null,""]
[null,"2002-11-02",0,0,10.477748327299601,{"$error":"#VALUE!"},0,0,0,0,0,0,0,{"$error":"#VALUE!"},0,{"$error":"#VALUE!"},0,0,0,{"$error":"#VALUE!"},0,0,0,{"$error":"#VALUE!"},0,"-","-","-","-","-","2002-11-02",13.3,null,""]
[null,"2002-11-03",0,0,10.445092940476099,{"$error":"#VALUE!"},0,0,0,0,0,0,0,{"$error":"#VALUE!"},0,{"$error":"#VALUE!"},0,0,0,{"$error":"#VALUE!"},0,0,0,{"$error":"#VALUE!"},0,"-","-","-","-","-","2002-11-03",13.2,null,""]
[null,"2002-11-04",0,0,10.412792564308299,{"$error":"#VALUE!"},0,0,0,0,0,0,0,{"$error":"#VALUE!"},0,{"$error":"#VALUE!"},0,0,0,{"$error":"#VALUE!"},0,0,0,{"$error":"#VALUE!"},0,"-","-","-","-","-","2002-11-04",13,null,""]
[null,"2002-11-05",0,0,10.380858915133601,{"$error":"#VALUE!"},0,0,0,0,0,0,0,{"$error":"#VALUE!"},0,{"$error":"#VALUE!"},0,0,0,{"$error":"#VALUE!"},0,0,0,{"$error":"#VALUE!"},0,"◎","-","-","-","-","2002-11-05",12.8,null,""]
[null,"2002-11-06",1,1,10.349303853003599,0.11545037063624219,0.11545037063624219,0,0,0,0,0,0,1.8695372050693038E-2,1.8695372050693038E-2,1.1429387831628366E-2,1.1429387831628366E-2,0,0,5.0124525206546859E-2,5.0124525206546859E-2,0,0,1.9436215963466966E-2,1.9436215963466966E-2,"-","-","-","-","-","2002-11-06",12.6,null,12.6]
[null,"2002-11-07",2,1,10.318139374432,0.11444035970905088,0.22989073034529306,0,0,0,0,0,0,1.8469295344268187E-2,3.7164667394961229E-2,1.1232209599507445E-2,2.2661597431135813E-2,0,0,4.9110783959564627E-2,9.9235309166111479E-2,0,0,1.9315559629848926E-2,3.8751775593315892E-2,"-","-","-","-","-","2002-11-07",12.5,null,12.5]
[null,"2002-11-08",3,1,10.287377604386,0.11238059116384098,0.34227132150913403,0,0,0,0,0,0,1.8215085574945344E-2,5.5379752969906576E-2,1.1004045387080722E-2,3.3665642818216532E-2,0,0,4.7107977686208634E-2,0.14634328685232012,0,0,1.9072568773264541E-2,5.7824344366580432E-2,"-","-","-","-","-","2002-11-08",12.3,null,12.3]
[null,"2002-11-09",4,1,10.2570307875119,0.11026946605977722,0.45254078756891125,0,0,0,0,0,0,1.7953332187788211E-2,7.3333085157694794E-2,1.0769510140713793E-2,4.4435152958930323E-2,0,0,4.5140980058833977E-2,0.19148426691115411,0,0,1.8827435531008459E-2,7.6651779897588895E-2,"-","-","-","-","-","2002-11-09",12.1,null,12.1]
[null,"2002-11-10",5,1,10.2271112785906,0.10810921189974329,0.56064999946865457,0,0,0,0,0,0,1.7683930611154159E-2,9.101701576884895E-2,1.0528768142616655E-2,5.4963921101546978E-2,0,0,4.3213033864204262E-2,0.23469730077535839,0,0,1.8580278121786302E-2,9.5232058019375204E-2,"-","-","-","-","-","2002-11-10",11.9,null,11.9]
{"$rows_left_out":244}
{"sheet":"気象データ","index":2,"n_rows":654,"n_cols":18,"rows_kept":654,"cut":false,"hidden":false,"merged":[]}
[]
[]
["日平均気温平年値(水戸地方気象台1991-2020)"]
[null,"北茨城","大子","常陸大宮","日立","笠間","水戸","古河","下館","下妻","鉾田","つくば(館野)","土浦","鹿嶋","龍ケ崎"]
[null,"B","C","D","E","F","G","H","I","J","K","L","M","N","O"]
["2013-10-15",16.3,15.1,15.5,17.2,16.399999999999999,16.7,17.3,16.7,16.899999999999999,16.600000000000001,16.8,17.399999999999999,18,17,null,1,1]
["2013-10-16",16.100000000000001,14.9,15.3,17,16.2,16.5,17.100000000000001,16.5,16.600000000000001,16.399999999999999,16.5,17.2,17.899999999999999,16.8,null,2,2]
["2013-10-17",15.9,14.6,15,16.8,15.9,16.3,16.899999999999999,16.3,16.399999999999999,16.2,16.3,17,17.7,16.600000000000001,null,3,3]
["2013-10-18",15.8,14.4,14.8,16.600000000000001,15.7,16.100000000000001,16.7,16.100000000000001,16.2,16,16.100000000000001,16.8,17.5,16.399999999999999,null,4,4]
["2013-10-19",15.6,14.1,14.6,16.5,15.5,15.9,16.5,15.9,16,15.8,15.9,16.600000000000001,17.3,16.2,null,5,5]
["2013-10-20",15.4,13.9,14.4,16.3,15.3,15.7,16.3,15.7,15.8,15.6,15.7,16.399999999999999,17.2,16,null,6,6]
["2013-10-21",15.2,13.7,14.2,16.100000000000001,15.1,15.5,16.100000000000001,15.5,15.6,15.4,15.5,16.3,17,15.8,null,7,7]
["2013-10-22",15.1,13.4,14,16,14.9,15.3,15.8,15.3,15.4,15.2,15.3,16.100000000000001,16.8,15.6,null,8,8]
["2013-10-23",14.9,13.2,13.8,15.8,14.7,15.1,15.6,15.1,15.2,15,15.1,15.9,16.7,15.4,null,9,9]
["2013-10-24",14.7,13,13.6,15.7,14.5,15,15.5,14.9,15,14.8,14.9,15.7,16.5,15.2,null,10,10]
["2013-10-25",14.6,12.8,13.4,15.5,14.2,14.8,15.3,14.7,14.8,14.6,14.7,15.5,16.3,15,null,11,11]
["2013-10-26",14.4,12.5,13.2,15.3,14.1,14.6,15.1,14.5,14.6,14.4,14.5,15.3,16.100000000000001,14.8,null,12,12]
["2013-10-27",14.2,12.3,13,15.2,13.9,14.4,14.9,14.3,14.4,14.2,14.3,15.2,16,14.7,null,null,13]
["2013-10-28",14.1,12.1,12.8,15,13.7,14.2,14.7,14.1,14.2,14,14.1,15,15.8,14.5,null,null,14]
["2013-10-29",13.9,11.9,12.6,14.9,13.5,14,14.5,13.9,14,13.8,13.9,14.8,15.6,14.3,null,null,15]
["2013-10-30",13.7,11.7,12.4,14.7,13.3,13.9,14.3,13.7,13.8,13.6,13.7,14.6,15.4,14,null,null,16]
["2013-10-31",13.6,11.4,12.2,14.6,13.1,13.7,14.1,13.5,13.6,13.4,13.5,14.4,15.3,13.8,null,null,17]
["2013-11-01",13.4,11.2,12,14.5,12.9,13.5,13.9,13.3,13.4,13.3,13.3,14.2,15.1,13.6,null,null,18]
["2013-11-02",13.2,11,11.8,14.3,12.7,13.3,13.7,13.1,13.2,13.1,13.1,14.1,14.9,13.5,null,null,19]
["2013-11-03",13.1,10.8,11.6,14.2,12.5,13.2,13.6,12.9,13,12.9,12.9,13.9,14.8,13.3,null,null,20]
["2013-11-04",12.9,10.7,11.5,14.1,12.4,13,13.4,12.8,12.8,12.7,12.7,13.7,14.6,13.1,null,null,21]
["2013-11-05",12.8,10.5,11.3,13.9,12.2,12.8,13.2,12.6,12.6,12.6,12.6,13.5,14.4,12.9,null,null,22]
["2013-11-06",12.6,10.3,11.1,13.8,12,12.6,13,12.4,12.5,12.4,12.4,13.3,14.3,12.7,null,null,23]
["2013-11-07",12.5,10.1,10.9,13.6,11.8,12.5,12.8,12.3,12.3,12.2,12.2,13.2,14.1,12.5,null,null,24]
["2013-11-08",12.3,9.9,10.7,13.4,11.6,12.3,12.6,12.1,12.1,12,12,13,13.9,12.4,null,null,25]
["2013-11-09",12.1,9.6999999999999993,10.6,13.3,11.5,12.1,12.4,11.9,11.9,11.9,11.8,12.8,13.8,12.2,null,null,26]
["2013-11-10",12,9.5,10.4,13.1,11.3,11.9,12.2,11.7,11.7,11.7,11.6,12.6,13.6,12,null,null,27]
["2013-11-11",11.8,9.1999999999999993,10.199999999999999,12.9,11.1,11.7,12,11.4,11.5,11.5,11.4,12.4,13.4,11.8,null,null,28]
["2013-11-12",11.6,9,9.9,12.7,10.8,11.5,11.8,11.2,11.2,11.3,11.2,12.2,13.2,11.6,null,null,29]
["2013-11-13",11.4,8.8000000000000007,9.6999999999999993,12.5,10.6,11.3,11.5,10.9,11,11.1,11,12,13,11.4,null,null,30]
["2013-11-14",11.2,8.6,9.5,12.3,10.4,11.1,11.3,10.7,10.8,10.9,10.8,11.8,12.8,11.2,null,null,31]
["2013-11-15",11,8.3000000000000007,9.3000000000000007,12.1,10.199999999999999,10.9,11.1,10.4,10.6,10.6,10.6,11.6,12.6,11]
["2013-11-16",10.8,8.1,9.1,11.9,10,10.7,10.9,10.199999999999999,10.4,10.4,10.4,11.4,12.4,10.8]
["2013-11-17",10.6,7.9,8.9,11.8,9.8000000000000007,10.5,10.6,10,10.199999999999999,10.199999999999999,10.199999999999999,11.1,12.2,10.6]
["2013-11-18",10.4,7.7,8.6999999999999993,11.6,9.6,10.3,10.4,9.8000000000000007,9.9,10,10,10.9,12,10.4]
{"$rows_left_out":614}